Mantis - Kaputt
Erweiterte Problemanzeige
124 general schwerer Fehler immer 2013-10-26 10:01 2013-10-26 10:08
jackyzhang  
 
normal  
neu 1.2  
offen  
keine    
keine  
0000124: fail to make tests in kaputt-1.2
After succsefully making all, I failed to make tests.
The platform informaton is as follows.
Ubuntu 10.04 LTS - the Lucid Lynx - released in April 2010 and supported until April 2013.
a@ubuntu:~/Desktop/kaputt-1.2$ make tests
test -f `pwd`/tests/Makefile && (cd `pwd`/tests && make --no-print-directory all && cd ..) || true
Running tests for 'assertion-based' (bytecode)...
Running tests for 'assertion-based' (native)...
File "source.ml", line 1:
Error: Cannot find file std_exit.cmx
make[3]: *** [compile] Error 2
make[2]: *** [one] Error 2
Running tests for 'enumerator-based' (bytecode)...
Running tests for 'enumerator-based' (native)...
File "source.ml", line 1:
Error: Cannot find file std_exit.cmx
make[3]: *** [compile] Error 2
make[2]: *** [one] Error 2
Running tests for 'generator-based' (bytecode)...
Running tests for 'generator-based' (native)...
File "source.ml", line 1:
Error: Cannot find file std_exit.cmx
make[3]: *** [compile] Error 2
make[2]: *** [one] Error 2
Running tests for 'outputs' (bytecode)...
Running tests for 'outputs' (native)...
File "source.ml", line 1:
Error: Cannot find file std_exit.cmx
make[3]: *** [compile] Error 2
make[2]: *** [one] Error 2
Running tests for 'preprocessor' (bytecode)...
Running tests for 'preprocessor' (native)...
File "/tmp/kaputtd18279.ml", line 1:
Error: Cannot find file std_exit.cmx
make[3]: *** [compile] Error 2
make[2]: *** [one] Error 2
Running tests for 'shell-based' (bytecode)...
Running tests for 'shell-based' (native)...
File "source.ml", line 1:
Error: Cannot find file std_exit.cmx
make[3]: *** [compile] Error 2
make[2]: *** [one] Error 2

12 error(s) in 12 test(s)
Problem-Historie
2013-10-26 10:01 jackyzhang Neues Problem
2013-10-26 10:08 jackyzhang Problemnotiz hinzugefügt: 0000281
2013-10-28 08:52 jackyzhang Problemnotiz bearbeitet: 0000281

Notiz
(0000281)
jackyzhang   
2013-10-26 10:08   
(bearbeitet am: 2013-10-28 08:52)
P.S. VMWare7, OCaml version is 4.01.0